BDBM50183596 (+)-(R)-1-Naphthalen-2-ylethanol::CHEMBL206560
SMILES C[C@@H](O)c1ccc2ccccc2c1
InChI Key InChIKey=AXRKCRWZRKETCK-SECBINFHSA-N
Data  2 IC50
  Tab Delimited (TSV)   2D SDfile   Computed 3D by Vconf -m prep SDfile
Find this compound or compounds like it in BindingDB:
Activity Spreadsheet -- Enzyme Inhibition Constant Data from BindingDB
Found 1 hit for monomerid = 50183596
TargetUDP-glucuronosyltransferase 2B7(Homo sapiens (Human))
University Of Helsinki
Curated by ChEMBL
LigandPNGBDBM50183596((+)-(R)-1-Naphthalen-2-ylethanol | CHEMBL206560)
Affinity DataIC50:  7.90E+4nM. Assay description: Inhibition of UGT2B7
In DepthDetails ArticlePubMed